ゆるふわめも

ただのメモです。

エラー解決

HTMLのチェックボックスの状態数を3つにする・チェックされた値を取得する

やりたいこと 解決法 indeterminateのチェックボックスの値を取得する やりたいこと <input type="checkbox" value="15" ... /> などとしたチェックボックスは通常チェックしたかしてないかの二つの状態しか取れない。しかしここを「チェックしてない、チェック1にした、チェック2にした」の三つの…

UnityのWebCamTextureからカメラが認識されないがPythonなどからは認識される

環境 解決方法 環境 Windows10 Unity 5.6.0f3 personal python3.6で走らせたOpencvなどからはウェブカメラをキャプチャできるが、Unity内部で走らせたWebCamTexture.devicesからは認識されていない 解決方法 以下のページのもので解決しました。 community.t…

「お絵描きの森」でワコムのペンタブを使うと点しか描けない

何かの手助けになれば。 環境 解決策 解決策1(ドライバ再インストール) 解決策2(デジタルインク機能を無効化) 解決策3 (他ブラウザ・OSを使用) 環境 OS: Windows 10 ブラウザ: chrome ペンタブ: Intuos Comic medium CTH-690 ペンタブを使用して線を…

エラー解決:No module named 'rest_framework'

環境 エラー内容 解決法 1. setting.py からの記述もれ 2. anaconda 環境にインストールされていない 3. それでもエラー 環境 Anaconda利用。 python3.6. Mac OSX. エラー内容 ImportError: No module named 'rest_framework' 解決法 1. setting.py からの記…

エラー解決:tensorflowのビルドにて"no such package '@protobuf// xxxx"

エラー内容 解決方法 参考 エラー内容 Ubuntu, CentOS にて tensorflow をビルドする際 $ bazel build --config=opt --config=cuda //tensorflow/tools/pip_package:build_pip_package ERROR: /home/xxx/git/tensorflow/tensorflow/tools/pip_package/BUILD:…

エラー解決:ImportError: No module named PyQt4

エラー内容 解決方法 エラー内容 Ubuntu 14.04, python 2.7, anaconda 環境にて。 Traceback (most recent call last): File "/home/xxx/anaconda/envs/master/lib/python2.7/site-packages/HPOlib-0.1.0-py2.7.egg/HPOlib/Plotting/doAllPlots.py", line 79…

エラー解決:auto-sklearnやSMAC3.0のインストールがpyrfrのエラーで終了する

エラー内容 環境 解決法 pyrfr関連のエラー pyrfr関係のエラーは探すとたくさん。はまってしまって時間が持ってかれた。 pyrfrはSMACと言うアルゴリズムで使用するRandomForestで使用するライブラリ。 エラー内容 XXXXX@XXXXX:~/SMAC3$ cat requirements.txt…

エラー解決:HPOlib2のインストール

インストールまで 環境 git リポジトリをクローン 環境の作成 関連ライブラリのインストール HPOlibのインストール ConfigSpaceのインストール openmlのインストール pynisherのインストール pyrfrのインストール その他エラーなど HPOlib2はブラックボック…

エラー解決:PythonのXGBoostで目的関数を変更する

これまでの場合 エラー内容 コード エラーメッセージ 解決 実装例・参考 これまでの場合 過去のバージョン(以下)では確か custom_objective パラメータにてgradientとhessian matrixを返すような関数を渡せばよかった。 paper.hatenadiary.jp xgboost-0.4a30…

エラー解決:DjangoにてDisallowedHost at.., Invalid HTTP_HOST header

エラー内容 解決法 ドキュメント エラー内容 DisallowedHost at / Invalid HTTP_HOST header: '10.22....:8001'. You may need to add '10.22....' to ALLOWED_HOSTS 解決法 djangoプロジェクト以下のyour_sitename/setting.pyにてALLOWED_HOSTSにIPアドレス…

エラー解決:Anaconda環境でauto-sklearnをインストール

エラー内容 インストール手順 環境に入る gccをインストール (必要なら)以下のライブラリをアンインストール auto-sklearnのインストール 追記 参考文献 エラー内容 python2.7, 3.5にて、OSはMac OS X. auto-sklearnのドキュメントにしたがって Anaconda以下…

エラー解決:PythonのAnaconda環境でXGBoostを利用した時「Reason: image not found」

エラー内容 XGBoostをimportする時に Reason: image not found となるか、jupyter notebookのカーネルが死ぬ。 解決方法 conda remove xgboost conda install -c aterrel xgboost=0.4.0 でオッケー。ただしこのバージョンでは自分で定義した目的関数を使った…

エラー解決:Exception: The shape of the input to "Flatten" is not fully defined

エラー内容 kerasを用いている時に Exception: The shape of the input to "Flatten" is not fully defined ... のエラー 解決方法 モデルの定義が正しい(レイヤー間の次元数の数が正しい)のに失敗する時は vim ~/.keras/keras.jsonとして { "image_dim_orde…

エラー解決:Cannot remove entries from nonexistent file ...easy-install.pth

エラー内容 pip3コマンドでインストールしようとした際に、依存関係のあるライブラリのバージョンを削除する場合があってその際に Cannot remove entries from nonexistent file anaconda...easy-install.pth のエラー。 解決 --ignore-installedオプション…

エラー解決:chainerを利用している時に AttributeError: 'module' object has no attribute 'full_like'

エラー内容 解決方法 エラー内容 いろいろ長いエラーの後に AttributeError: 'module' object has no attribute 'full_like' と言われる。 解決方法 chainerでGPUを利用しない場合、以下の箇所で numpyに切り替わる。 そのnumpyにfull_linkの属性がないため…

エラー解決:Conda 'ImportError: No module named ruamel.yaml.comments'

エラーメッセージ 解決方法 エラーメッセージ Conda 'ImportError: No module named ruamel.yaml.comments' 解決方法 pip install ruamel_yaml pip install pycosat

エラー解決:LaTeX Error: Cannot determine size of image (no BoundingBox)のエラー

エラー内容 解決法 Step1 Step2 Step3 Step4 エラー内容 LaTeX Error: Cannot determine size of image (no BoundingBox) 解決法 Step1 \usepackage[dvipdfmx]{graphicx} 大概これで解決。 Step2 dvipdfmxが無いと言われている場合は、こちらからダウンロー…

エラー解決:clang-omp++: command not found

エラーメッセージ 解決方法 mac os ei capitanにて。 エラーメッセージ make: *** [build/learner.o] Error 127 make: *** Waiting for unfinished jobs.... /bin/sh: clang-omp++: command not found make: *** [build/logging.o] Error 127 解決方法 $ bre…

エラー解決:macでlatexに挿入したpdfの図が表示されない

エラー内容 解決方法 その1 その2 その3 その4 エラー内容 pdfの図を挿入しても表示されない。 エラーの一部に dvipdfmx:warning: Unparsed material at end of special ignored だったり LaTeX Error: Cannot determine size of graphic in ... (no bou…

python, pandas.DataFrameにてapply内部のlambda式でtry, exceptを行う

コード try and catch部分 変換部分 最後に 結論から言うとできないそうです。 もっとも利用するのは DataFrame形式にapplyを使ってデータを変換する時だと思います、自分だけかもしれないですが。 コード とっさに作った例ですが、データに含まれる文字列の…

エラー解決:locale.Error: unsupported locale setting

エラー内容 ubuntu14.04にて pip installを行おうとして locale.Error: unsupported locale setting というエラーが出る。 解決法 export LC_ALL="en_US.UTF-8" export LC_CTYPE="en_US.UTF-8" sudo dpkg-reconfigure locales

pythonのloggingの詳細設定を行う

利用するたびに設定を指定する .confにロギングの設定を指定する 詳細 データ解析のステップが大きくなってくるとログファイルを出力しないとどこにエラーがが入ったかやバグのチェックが大変になってくるのでメモ。 利用するたびに設定を指定する 一瞬使い…

エラー解決:jupyterlabを起動する際に 404 not found

エラー内容 解決法 もともとのインストール法 解決した時のインストール法 jupyterhubのケース エラー内容 jupyterlabを起動する際に 404 not foundが返ってくる。ログでは404 GET lab referer=Noneと出力される。 解決法 condaの環境に jupyter labが登録さ…

jupyter notebook上でコマンドを実行する

時たまに、jupyter notebook上でコマンドを実行したい時があります。 並列処理や、ファイルの変換などです。 解決法 %%bashをつければ実行できます。 %%bash /usr/local/bin/dot -Tpng tree.dot -o tree.png

Latexで画像(.png等)が表示されない場合

エラー内容 \begin{figure*}[t] \begin{center} \includegraphics[width=10cm,bb=0 0 600 300]{fig/fig.png} \end{center} \caption{図の説明} \label{fig:image_label} \end{figure*} としても画像が表示されない。しかし pdf画像は表示される。 解決法 \us…

AWSでcuDNNを利用する+Couldn't open CUDA library libcudnn.soの解決

やりたいこと NVIDIAのcuDNNを使って高速にGPUを利用したい、AWSで。 すること cuDNNをダウンロード https://developer.nvidia.com/rdp/cudnn-download からダウンロード。登録が必要。 scp で aws へファイルをコピー scp -i (AWSのpemファイル).pem -r Dow…

AWSにてImportError: libcudart.so.7.5: cannot open shared object file:

エラー内容 AWS, ubuntu14.04にて python を実行すると ImportError: libcudart.so.7.5: cannot open shared object file: となる。 解決法 はじめにlibcudart.so.7.5に対応するcudaのインストールができているかを確認する。 この場合は'CUDA-7.5'が対応。 …

Exception: Can't change the value of this config parameter after initialization! のエラー

エラー内容 Exception: Can't change the value of this config parameter after initialization! 解決法 pythonで環境変数を書き換える場合は、 import os os.environ['THEANO_FLAGS'] = "..." をファイルの先頭に記述。ただ、THEANO_FLAGSを事前に変更して…

エラー解決:Mac os X で (sh: sysctl: command not found)などコマンドが見つからないエラー

エラー内容 % sudo python main.py (git)-[master] sh: sysctl: command not found 解決法 sudo find / -name sysctl としたら find: /dev/fd/3: Not a directory find: /dev/fd/4: Not a directory /usr/sbin/sysctl と出てきたので/usr/sbinをパスに追加。…

luarocks install nn で fatal error

エラー内容 paper.hatenadiary.jp を行っている時に Installing https://luarocks.org/nn-1.0.4-1.src.rock... Using https://luarocks.org/nn-1.0.4-1.src.rock... switching to 'build' mode env MACOSX_DEPLOYMENT_TARGET=10.8 gcc -O2 -fPIC -I/usr/loca…